287 comments found.

Hello, I tried to login to the admin area, but I could not. Can you give me the the correct login details? Another question. I would like make a hungarian app, is it easy to translate?

Sorry for late .. Are you still interested ?

how can develop game like this https://goo.gl/aQPS3B Thank you

Actually i am not sure .. maybe by unity or any other program

Hello There,

I purchased your source code some time ago. What is your rate to convert this to Android Studio?

Regards, DC

Send me an email please or message

I tried to access the administrative area but it did not work.

Sorry for that .. I will reupload it and inform you here ..

does it support right to left languages?

the demo admin panel isn’t working – php error – can you direct me to a working admin panel please? thanks, John

Also, please can you provide tutorial to import into android studio – the link you provided is for eclipse import only and is not the same as importing into android studio – thanks, John

Hi – it also looks like that the downloaded files don’t contain the Android project version and only Eclipse files – please advise

Sent you friend :) Waiting for your ftp.

can you let me know if you have fixed the admin panel?

I will send you tomorrow with the fix for sure

ok – also when importing into Android studio the following errors occur:

Information:Gradle tasks [:facebookSDK:generateDebugSources, :facebookSDK:generateDebugAndroidTestSources, :facebookSDK:mockableAndroidJar, :successQuotes:generateDebugSources, :successQuotes:generateDebugAndroidTestSources, :successQuotes:mockableAndroidJar] Warning:The specified Android SDK Build Tools version (23.0.2) is ignored, as it is below the minimum supported version (26.0.2) for Android Gradle Plugin 3.0.1. Android SDK Build Tools 26.0.2 will be used. To suppress this warning, remove “buildToolsVersion ‘23.0.2’” from your build.gradle file, as each version of the Android Gradle Plugin now has a default version of the build tools. /Users/john/Desktop/SuccessQuotes/successQuotes/src/main/res/values/styles.xml Error:(29, 2) error: style attribute ’@android:attr/windowEnterAnimation’ not found. Error:(29, 2) error: style attribute ’@android:attr/windowExitAnimation’ not found. Error:(34, 2) error: style attribute ’@android:attr/windowEnterAnimation’ not found. Error:(34, 2) error: style attribute ’@android:attr/windowExitAnimation’ not found. Error:(45, 2) error: style attribute ’@android:attr/windowEnterAnimation’ not found. Error:(45, 2) error: style attribute ’@android:attr/windowExitAnimation’ not found. Error:(47, 2) error: style attribute ’@android:attr/windowEnterAnimation’ not found. Error:(47, 2) error: style attribute ’@android:attr/windowExitAnimation’ not found. Error:(52, 2) error: style attribute ’@android:attr/windowEnterAnimation’ not found. Error:(52, 2) error: style attribute ’@android:attr/windowExitAnimation’ not found. Error:(7, 5) error: style attribute ’@android:attr/windowEnterAnimation’ not found. Error:(7, 5) error: style attribute ’@android:attr/windowExitAnimation’ not found. /Users/john/Desktop/SuccessQuotes/successQuotes/build/intermediates/incremental/mergeDebugResources/merged.dir/values/values.xml Error:(463) style attribute ’@android:attr/windowEnterAnimation’ not found. Error:(464) style attribute ’@android:attr/windowExitAnimation’ not found. Error:(467) style attribute ’@android:attr/windowEnterAnimation’ not found. Error:(468) style attribute ’@android:attr/windowExitAnimation’ not found. Error:(471) style attribute ’@android:attr/windowEnterAnimation’ not found. Error:(472) style attribute ’@android:attr/windowExitAnimation’ not found. Error:(476) style attribute ’@android:attr/windowEnterAnimation’ not found. Error:(477) style attribute ’@android:attr/windowExitAnimation’ not found. Error:(480) style attribute ’@android:attr/windowEnterAnimation’ not found. Error:(481) style attribute ’@android:attr/windowExitAnimation’ not found. Error:(484) style attribute ’@android:attr/windowEnterAnimation’ not found. Error:(485) style attribute ’@android:attr/windowExitAnimation’ not found. Error:failed linking references. Error:java.util.concurrent.ExecutionException: java.util.concurrent.ExecutionException: com.android.tools.aapt2.Aapt2Exception: AAPT2 error: check logs for details Error:java.util.concurrent.ExecutionException: com.android.tools.aapt2.Aapt2Exception: AAPT2 error: check logs for details Error:com.android.tools.aapt2.Aapt2Exception: AAPT2 error: check logs for details Error:Execution failed for task ’:successQuotes:processDebugResources’. > Failed to execute aapt Information:BUILD FAILED in 43s Information:29 errors Information:1 warning Information:See complete output in console

Please advise – John

by
by
by
by
by
by