Code

Discussion on Glover – Grocery, Food, Pharmacy Courier & Service Provider + Backend + Driver & Vendor app

Discussion on Glover – Grocery, Food, Pharmacy Courier & Service Provider + Backend + Driver & Vendor app

Cart 1,057 sales
Recently Updated

2225 comments found.

How do I get the user’s website

please open ticket on discord

This comment is currently being reviewed.

elakonet

elakonet Purchased

Hi EdenTech, I encountered this error:

/D:/Pub/hosted/pub.dartlang.org/fwfh_text_style-2.22.08/lib/fwfh_text_style.dart:11:7: Error: The non-abstract class ‘FwfhTextStyle’ is missing implementations for these members: – TextStyle.fontVariations Try to either – provide an implementation, – inherit an implementation from a superclass or mixin, – mark the class as abstract, or – provide a ‘noSuchMethod’ implementation.

class FwfhTextStyle extends _TextStyleProxy { ^^^^^^^ /C:/src/flutter/packages/flutter/lib/src/painting/text_style.dart:789:33: Context: ‘TextStyle.fontVariations’ is defined here. final List<ui.FontVariation>? fontVariations; ^^^^^^^^ /D:/Pub/hosted/pub.dartlang.org/fwfh_text_style-2.22.08/lib/fwfh_text_style.dart:43:13: Error: The method ‘FwfhTextStyle.apply’ has fewer named arguments than those of overridden method ‘TextStyle.apply’. TextStyle apply({ ^ /C:/src/flutter/packages/flutter/lib/src/painting/text_style.dart:911:13: Context: This is the overridden method (‘apply’). TextStyle apply({ ^ /D:/Pub/hosted/pub.dartlang.org/fwfh_text_style-2.22.08/lib/fwfh_text_style.dart:43:13: Error: The method ‘FwfhTextStyle.apply’ doesn’t have the named parameter ‘fontVariations’ of overridden method ‘TextStyle.apply’. TextStyle apply({ ^ /C:/src/flutter/packages/flutter/lib/src/painting/text_style.dart:911:13: Context: This is the overridden method (‘apply’). TextStyle apply({ ^ /D:/Pub/hosted/pub.dartlang.org/fwfh_text_style-2.22.08/lib/fwfh_text_style.dart:103:13: Error: The method ‘FwfhTextStyle.copyWith’ has fewer named arguments than those of overridden method ‘TextStyle.copyWith’. TextStyle copyWith({ ^ /C:/src/flutter/packages/flutter/lib/src/painting/text_style.dart:814:13: Context: This is the overridden method (‘copyWith’). TextStyle copyWith({ ^ /D:/Pub/hosted/pub.dartlang.org/fwfh_text_style-2.22.08/lib/fwfh_text_style.dart:103:13: Error: The method ‘FwfhTextStyle.copyWith’ doesn’t have the named parameter ‘fontVariations’ of overridden method ‘TextStyle.copyWith’. TextStyle copyWith({ ^ /C:/src/flutter/packages/flutter/lib/src/painting/text_style.dart:814:13: Context: This is the overridden method (‘copyWith’). TextStyle copyWith({ ^

FAILURE: Build failed with an exception.

  • Where: Script ‘C:\src\flutter\packages\flutter_tools\gradle\flutter.gradle’ line: 1159
  • What went wrong: Execution failed for task ’:app:compileFlutterBuildRelease’. > Process ‘command ‘C:\src\flutter\bin\flutter.bat’’ finished with non-zero exit value 1
  • Try: Run with—stacktrace option to get the stack trace. Run with—info or—debug option to get more log output. Run with—scan to get full insights.

BUILD FAILED in 54s Running Gradle task ‘assembleRelease’... 55.2s Gradle task assembleRelease failed with exit code 1

elakonet

elakonet Purchased

kindly help this is for the vendor app

Eden please, where can I locate the loyalty points on the demo apps?

Dear sir,

please solve the issue for ticket 3614

royalsoni

royalsoni Purchased

shows this error while running code in vendor and customer application Could not write file to E:\codecanyon-BMd7H0j4-fuodz-grocery-food-pharmacy-store-parcelcourier-delivery-mobile-app-with-php-laravel-backend\1.6.3\Apps\Customer\multi_delivery_customer\build\app\intermediates\flutter\debug\flutter_assets\shaders/ink_sparkle.frag FAILURE: Build failed with an exception.
  • Where: Script ‘C:\src\flutter\packages\flutter_tools\gradle\flutter.gradle’ line: 1159
  • What went wrong: Execution failed for task ’:app:compileFlutterBuildDebug’. > Process ‘command ‘C:\src\flutter\bin\flutter.bat’’ finished with non-zero exit value 1
  • Try: Run with—stacktrace option to get the stack trace. Run with—info or—debug option to get more log output. Run with—scan to get full insights.
  • Get more help at https://help.gradle.org BUILD FAILED in 1m 13s Exception: Gradle task assembleDebug failed with exit code 1

already answer your ticket

i got the same issue below user “arorub” please solve this issue

Open discord, its already answered

arorub Purchased

I kindly ask you to focus more on the stability of the system, and stop adding more features, the more features you add, the more complex and more ISSUES appear.

Below it mentions some of the issues that I found in its latest version 1.6.3 – and I repeat only some issues:.

-  1. The commission is only reflected end work if you assign the commission for each individual taxi or delivery boy driver by entering the profile and defining the individual commission, General Drivers Commission( ) and General Vendors Commission( ) is not working if you assign it from in /setting/finance/settings.
-  2. The driver error application, passenger pickup is different from the real one, about 8,000 km difference.
-  3. The user app is not giving refund after the cancellation by the client..
-  4. When making the withdrawal by the administrator to the driver's wallet, nothing is deposited into the driver's wallet.

It’s been more than a year since I bought your system and I haven’t been able to launch the open day it due to its instability and so many issues, Another piece of advice is that you should not release a version if it is not at least 98% without issues, it is better to wait until you have to go through all this work.

It seems that we are like indirect employees who test issues for the formation of your system.

When we buy your system we hope that you don’t have issues or at least they are very few or not that much important issues. Take this as advice for the growth of your company and for people like me who buy the system with the hope of having a stable system and starting a successful business. Thank you for your attention/.

We have more than 100 people already in production with thousands of users. All your message above has already been answered in the discord server

hi. production: no logos, images banners are saving. Can you tell me simply why?

check faq in the project documentation on fixing image issues

Is there a way to add payment via pix for buyers from Brazil?

you can request custom payment gateway via discord server at a fee

bufferspk Purchased

Any plan tot add brands ?

None for now

sanuji

sanuji Purchased

Exception App is in demo version. Some changes can’t be made

please set APP_ENV=production in your .env file

Eden, please I hope there will be the options to choose from the future new UI update and the old, in case someone prefers either of them. Thanks

Also, could you guys consider adding a FAQ page to the system. Thanks

ok

kenny9 Purchased

Hello I bought your script and I keep getting errors when I open the app and also when I attempt to login to app .. backend logs in fine but app has errors like the one in this link here https://drive.google.com/file/d/1za_xnbawe85uzJfDEo-5GPpukdWP64rK/view?usp=sharing

kenny9 Purchased

This seller ignoring my comments

kenny9 Purchased

@EdenTech respond

Hi, please follow the project documentation to setup properly. From the error screenshot you show above, you have to setup firebase on the backend, this is already mentioned and included in the project documentation

I don’t see loyalty point feature in th demo

there is loyalty point, please double check to confirm

sanuji

sanuji Purchased

Illuminate\Database\QueryException SQLSTATE[42S02]: Base table or view not found: 1146 Table ‘u348611473_admin.settings’ doesn’t exist (SQL: select * from `settings`)

sanuji

sanuji Purchased

I SOLVED THIS PROBLEM

sanuji

sanuji Purchased

Illuminate\Database\QueryException SQLSTATEHY000 Access denied for user ‘u348611473_admin’@’127.0.0.1’ (using password: YES) (SQL: select * from `settings`) in backed installation

please setup your database details in your .env file

sanuji

sanuji Purchased

Illuminate\Database\QueryException SQLSTATE[42S02]: Base table or view not found: 1146 Table ‘u348611473_admin.settings’ doesn’t exist (SQL: select * from `settings`)

sanuji

sanuji Purchased

I SOLVED THIS PROBLEM

Dear sir, after update new version 1.6.3, unable to open the backend error 500 is coming. how to resolve the issue. Please Suggest

Please check error logs to see what the issue is

host admin.quik-ship.com] Backend fatal error: PHP Fatal error: Uncaught Error: Class “Illuminate\\Support\\Collection” not found in /home1/quiksoto/admin.quik-ship.com/vendor/laravel/framework/src/Illuminate/Collections/helpers.php:15\nStack trace:\n#0 /home1/quiksoto/admin.quik-ship.com/vendor/laravel/framework/src/Illuminate/Support/Traits/ReflectsClosures.php(24): collect(Array)\n#1 /home1/quiksoto/admin.quik-ship.com/vendor/laravel/framework/src/Illuminate/Support/Traits/ReflectsClosures.php(44): Illuminate\\Foundation\\Exceptions\\ReportableHandler->closureParameterTypes(Object(Closure))\n#2 /home1/quiksoto/admin.quik-ship.com/vendor/laravel/framework/src/Illuminate/Foundation/Exceptions/ReportableHandler.php(62): Illuminate\\Foundation\\Exceptions\\ReportableHandler->firstClosureParameterType(Object(Closure))\n#3 /home1/quiksoto/admin.quik-ship.com/vendor/laravel/framework/src/Illuminate/Foundation/Exceptions/Handler.php(234): Illuminate\\Foundation\\Exceptions\\ReportableHandler->handles(Object(Symfony\\Component\\ErrorHandler\\Error\\FatalError))\n#4 /home1/quiksoto/admin.quik-ship.com/vendor/laravel/framework/src/Illuminate/Foundation/Bootstrap/HandleExceptions.php(88): Illuminate\\Foundation\\Exceptions\\Handler->report(Object(Symfony\\Component\\ErrorHandler\\Error\\FatalError))\n#5 /home1/quiksoto/admin.quik-ship.com/vendor/laravel/framework/src/Illuminate/Foundation/Bootstrap/HandleExceptions.php(130): Illuminate\\Foundation\\Bootstrap\\HandleExceptions->handleException(Object(Symfony\\Component\\ErrorHandler\\Error\\FatalError))\n#6 [internal function]: Illuminate\\Foundation\\Bootstrap\\HandleExceptions->handleShutdown()\n#7 {main}\n thrown in /home1/quiksoto/admin.quik-ship.com/vendor/laravel/framework/src/Illuminate/Collections/helpers.php on line 15\

Please don’t post error log in comment, rather open a ticket on discord server

CDS22

CDS22 Purchased

I have a question, I have changed the app startup colors to my custom colors, I have changed all the colors #5e17eb, but my app startup still shows purple, what should I do or what line should I change to customize to white, I have also changed the colors from the backend. https://ibb.co/GJNZvdh

Hi, I was hoping you could customize the system to allow restaurants owners to have their one link that only shows their items and logo no go-back button to the multi-restaurant home page and assign this feature to paid package subscription

Please let me know how much it will cost and how long it will take.

please open ticket on our discord server

by
by
by
by
by
by

Tell us what you think!

We'd like to ask you a few questions to help improve CodeCanyon.

Sure, take me to the survey